Reaction Details
TargetGenome polyprotein
LigandBDBM333048
Substrate/Competitorn/a
Meas. Tech.HBsAg Assay
IC50 1375±n/a nM
Citation Cheng, ZWang, MYang, S Tetrahydropyridopyrimidines and tetrahydropyridopyridines for the treatment and prophylaxis of hepatitis B virus infection US Patent US10196391 Publication Date 2/5/2019
 
Genome polyprotein
Name:Genome polyprotein
Type:PROTEIN
Mol. Mass.:312770.83
Organism:Hepatitis GB virus B
Description:ChEMBL_330657
Residue:2864
BDBM333048
NameBDBM333048
Synonyms:US10196391, Example 48
TypeSmall organic molecule
Emp. Form.C19H17N5O2
Mol. Mass.347.3706
SMILESCC1CN(Cc2cnc(nc12)-c1ccccn1)c1ccc(cc1)[N+]([O-])=O