Reaction Details
TargetGenome polyprotein
LigandBDBM333060
Substrate/Competitorn/a
Meas. Tech.HBsAg Assay
IC50 371±n/a nM
Citation Cheng, ZWang, MYang, S Tetrahydropyridopyrimidines and tetrahydropyridopyridines for the treatment and prophylaxis of hepatitis B virus infection US Patent US10196391 Publication Date 2/5/2019
 
Genome polyprotein
Name:Genome polyprotein
Type:PROTEIN
Mol. Mass.:312770.83
Organism:Hepatitis GB virus B
Description:ChEMBL_330657
Residue:2864
BDBM333060
NameBDBM333060
Synonyms:US10196391, Example 60
TypeSmall organic molecule
Emp. Form.C20H17N5O
Mol. Mass.343.3819
SMILESCOc1cc(ccc1C#N)N1CCc2nc(ncc2C1)-c1ccccn1