Reaction Details
TargetGenome polyprotein
LigandBDBM333076
Substrate/Competitorn/a
Meas. Tech.HBsAg Assay
IC50 1513±n/a nM
Citation Cheng, ZWang, MYang, S Tetrahydropyridopyrimidines and tetrahydropyridopyridines for the treatment and prophylaxis of hepatitis B virus infection US Patent US10196391 Publication Date 2/5/2019
 
Genome polyprotein
Name:Genome polyprotein
Type:PROTEIN
Mol. Mass.:312770.83
Organism:Hepatitis GB virus B
Description:ChEMBL_330657
Residue:2864
BDBM333076
NameBDBM333076
Synonyms:US10196391, Example 76
TypeSmall organic molecule
Emp. Form.C19H16N6O
Mol. Mass.344.3699
SMILESCOc1cc(cc(c1)N1CCc2nc(ncc2C1)-c1ncccn1)C#N