Reaction Details
TargetGenome polyprotein
LigandBDBM333113
Substrate/Competitorn/a
Meas. Tech.HBsAg Assay
IC50 161±n/a nM
Citation Cheng, ZWang, MYang, S Tetrahydropyridopyrimidines and tetrahydropyridopyridines for the treatment and prophylaxis of hepatitis B virus infection US Patent US10196391 Publication Date 2/5/2019
 
Genome polyprotein
Name:Genome polyprotein
Type:PROTEIN
Mol. Mass.:312770.83
Organism:Hepatitis GB virus B
Description:ChEMBL_330657
Residue:2864
BDBM333113
NameBDBM333113
Synonyms:US10196391, Example 113
TypeSmall organic molecule
Emp. Form.C16H12Cl2N6
Mol. Mass.359.213
SMILESClc1cc(Cl)nc(c1)N1CCc2nc(ncc2C1)-c1ncccn1