Reaction Details
TargetMAP kinase-interacting serine/threonine-protein kinase 1
LigandBDBM333401
Substrate/Competitorn/a
Meas. Tech.Kinase Assay
IC50 1.000±n/a nM
Citation Eis, KPühler, FZorn, LScholz, ALienau, PGnoth, MJBömer, UGünther, JFanghänel, JKorr, D Substituted aminoimidazopyridazines US Patent US9730929 Publication Date 8/15/2017
 
MAP kinase-interacting serine/threonine-protein kinase 1
Name:MAP kinase-interacting serine/threonine-protein kinase 1
Type:Serine/threonine-protein kinase
Mol. Mass.:51342.85
Organism:Homo sapiens (Human)
Description:Q9BUB5
Residue:465
BDBM333401
NameBDBM333401
Synonyms:2-{[3-(Furo[2,3-c]pyridin-2-yl)imidazo[1,2-b]pyridazin-6-yl](methyl)amino}-1-phenylethanol | US9730929, Example 22
TypeSmall organic molecule
Emp. Form.C22H19N5O2
Mol. Mass.385.4186
SMILESCN(CC(O)c1ccccc1)c1ccc2ncc(-c3cc4ccncc4o3)n2n1