Reaction Details
TargetRAF proto-oncogene serine/threonine-protein kinase
LigandBDBM333573
Substrate/Competitorn/a
Meas. Tech.Competition Binding Assay
Kd<250±n/a nM
Citation Abraham, SBhagwat, SSCampbell, BTChao, QFaraoni, RHolladay, MWLai, AGRowbottom, MWSetti, ESprankle, KG RAF kinase modulator compounds and methods of use thereof US Patent US9730937 Publication Date 8/15/2017
 
RAF proto-oncogene serine/threonine-protein kinase
Name:RAF proto-oncogene serine/threonine-protein kinase
Type:Serine/threonine-protein kinase
Mol. Mass.:73082.52
Organism:Homo sapiens (Human)
Description:P04049
Residue:648
BDBM333573
NameBDBM333573
Synonyms:1-(3-tert- butylphenyl)- 3-(3-(6,7- dimethoxy- quinazolin- 4- ylthio)phenyl) urea | US9730937, Example 120
TypeSmall organic molecule
Emp. Form.C27H28N4O3S
Mol. Mass.488.601
SMILESCOc1cc2ncnc(Sc3cccc(NC(=O)Nc4cccc(c4)C(C)(C)C)c3)c2cc1OC