Reaction Details
TargetRAF proto-oncogene serine/threonine-protein kinase
LigandBDBM333578
Substrate/Competitorn/a
Meas. Tech.Competition Binding Assay
Kd<250±n/a nM
Citation Abraham, SBhagwat, SSCampbell, BTChao, QFaraoni, RHolladay, MWLai, AGRowbottom, MWSetti, ESprankle, KG RAF kinase modulator compounds and methods of use thereof US Patent US9730937 Publication Date 8/15/2017
 
RAF proto-oncogene serine/threonine-protein kinase
Name:RAF proto-oncogene serine/threonine-protein kinase
Type:Serine/threonine-protein kinase
Mol. Mass.:73082.52
Organism:Homo sapiens (Human)
Description:P04049
Residue:648
BDBM333578
NameBDBM333578
Synonyms:1-(3-(6,7- dimethoxy- quinazolin- 4- yloxy)phenyl)- 3-(3- (2- fluoropropan-2- yl)isoxazol- 5-yl) urea US9730937, Example 136
TypeSmall organic molecule
Emp. Form.C23H22FN5O5
Mol. Mass.467.4497
SMILESCOc1cc2ncnc(Oc3cccc(NC(=O)Nc4cc(on4)C(C)(C)F)c3)c2cc1OC