Reaction Details
TargetRAF proto-oncogene serine/threonine-protein kinase
LigandBDBM333615
Substrate/Competitorn/a
Meas. Tech.Competition Binding Assay
Kd<250±n/a nM
Citation Abraham, SBhagwat, SSCampbell, BTChao, QFaraoni, RHolladay, MWLai, AGRowbottom, MWSetti, ESprankle, KG RAF kinase modulator compounds and methods of use thereof US Patent US9730937 Publication Date 8/15/2017
 
RAF proto-oncogene serine/threonine-protein kinase
Name:RAF proto-oncogene serine/threonine-protein kinase
Type:Serine/threonine-protein kinase
Mol. Mass.:73082.52
Organism:Homo sapiens (Human)
Description:P04049
Residue:648
BDBM333615
NameBDBM333615
Synonyms:1-[3-(6,7- dimethoxy- quinazolin- 4- yloxy)phenyl]- 3-[1- methyl-3- (trifluoromethyl)- 1H- pyrazol-5-yl]urea | US9730937, Example 164
TypeSmall organic molecule
Emp. Form.C22H19F3N6O4
Mol. Mass.488.4193
SMILESCOc1cc2ncnc(Oc3cccc(NC(=O)Nc4cc(nn4C)C(F)(F)F)c3)c2cc1OC