Reaction Details
TargetRAF proto-oncogene serine/threonine-protein kinase
LigandBDBM333679
Substrate/Competitorn/a
Meas. Tech.Competition Binding Assay
Kd<250±n/a nM
Citation Abraham, SBhagwat, SSCampbell, BTChao, QFaraoni, RHolladay, MWLai, AGRowbottom, MWSetti, ESprankle, KG RAF kinase modulator compounds and methods of use thereof US Patent US9730937 Publication Date 8/15/2017
 
RAF proto-oncogene serine/threonine-protein kinase
Name:RAF proto-oncogene serine/threonine-protein kinase
Type:Serine/threonine-protein kinase
Mol. Mass.:73082.52
Organism:Homo sapiens (Human)
Description:P04049
Residue:648
BDBM333679
NameBDBM333679
Synonyms:1-(3-(6- methoxy-7- (2- methoxyethoxy) quinazolin-4- yloxy)phenyl)- 3-(3- (trifluoromethyl) isoxazol- 5-yl)urea | US9730937, Example 229
TypeSmall organic molecule
Emp. Form.C23H20F3N5O6
Mol. Mass.519.43
SMILESCOCCOc1cc2ncnc(Oc3cccc(NC(=O)Nc4cc(no4)C(F)(F)F)c3)c2cc1OC