Reaction Details
TargetRAF proto-oncogene serine/threonine-protein kinase
LigandBDBM333685
Substrate/Competitorn/a
Meas. Tech.Competition Binding Assay
Kd<250±n/a nM
Citation Abraham, SBhagwat, SSCampbell, BTChao, QFaraoni, RHolladay, MWLai, AGRowbottom, MWSetti, ESprankle, KG RAF kinase modulator compounds and methods of use thereof US Patent US9730937 Publication Date 8/15/2017
 
RAF proto-oncogene serine/threonine-protein kinase
Name:RAF proto-oncogene serine/threonine-protein kinase
Type:Serine/threonine-protein kinase
Mol. Mass.:73082.52
Organism:Homo sapiens (Human)
Description:P04049
Residue:648
BDBM333685
NameBDBM333685
Synonyms:1-(5- cyclopentyl- isoxazol- 3- yl)-3-(3-(6- methoxy-7-(2- methoxyethoxy) quinazolin-4- ylthio)phenyl) urea | US9730937, Example 235
TypeSmall organic molecule
Emp. Form.C27H29N5O5S
Mol. Mass.535.615
SMILESCOCCOc1cc2ncnc(Sc3cccc(NC(=O)Nc4cc(on4)C4CCCC4)c3)c2cc1OC