Reaction Details
TargetNitric oxide synthase, inducible
LigandBDBM50446250
Substrate/Competitorn/a
Meas. Tech.Inhibition Assay
Ki 2954±n/a nM
Citation Silverman, RBJing, Q 2-aminopyridine-based selective neuronal nitric oxide synthase inhibitors US Patent US9732037 Publication Date 8/15/2017
 
Nitric oxide synthase, inducible
Name:Nitric oxide synthase, inducible
Type:Homodimer
Mol. Mass.:131141.95
Organism:Homo sapiens (Human)
Description:P35228
Residue:1153
BDBM50446250
NameBDBM50446250
Synonyms:CHEMBL3109188 | US9732037, Compound 9
TypeSmall organic molecule
Emp. Form.C19H27N5O2
Mol. Mass.357.45
SMILESCc1cc(N)nc(COC[C@H]2C[C@@H](CN2)OCc2cc(C)cc(N)n2)c1