Reaction Details
TargetAndrogen receptor
LigandBDBM334278
Substrate/Competitorn/a
Meas. Tech.Biological Assay
Kd 6000±n/a nM
Citation Poinsard, C N-(pyrid-4-yl)amides and N-(pyrimidin-4-yl)amides and their pharmaceutical and cosmetic use US Patent US9732044 Publication Date 8/15/2017
 
Androgen receptor
Name:Androgen receptor
Type:Receptor
Mol. Mass.:99185.27
Organism:Homo sapiens (Human)
Description:CHO cells were stably transfected with human AR gene.
Residue:920
BDBM334278
NameBDBM334278
Synonyms:4-(2-Hydroxy-2- methyl- pentanoylamino)- pyridine-2-carboxylic acid methyl ester | US9732044, 59
TypeSmall organic molecule
Emp. Form.C13H18N2O4
Mol. Mass.266.293
SMILESCCCC(C)(O)C(=O)Nc1ccnc(c1)C(=O)OC