Reaction Details
TargetSolute carrier family 22 member 2
LigandBDBM330043
Substrate/Competitorn/a
Meas. Tech.Inhibition Assay
IC50 610±n/a nM
Citation Jin, HLazerwith, SEPyun, HBacon, EMMorganelli, PAJi, M Substituted 2,3,4,5,7,9,13,13a-octahydropyrido[1′,2′:4,5]pyrazino[2,1-b][1,3]OXAZEPINES and methods for treating viral infections US Patent US9732092 Publication Date 8/15/2017
 
Solute carrier family 22 member 2
Name:Solute carrier family 22 member 2
Type:PROTEIN
Mol. Mass.:62591.01
Organism:Homo sapiens (Human)
Description:ChEMBL_1484077
Residue:555
BDBM330043
NameBDBM330043
Synonyms:(2S,5R,13aS)-N—((S)-1-(2,4-difluorophenyl)ethyl)-8-hydroxy-7,9-dioxo-2,3,4,5,7,9,13,13a-octahydro-2,5-methanopyrido[1′,2′:4,5]pyrazino[2,1-b][1,3]oxazepine-10-carboxamide US9663528, 13 | US9732092, Compound 13
TypeSmall organic molecule
Emp. Form.C22H21F2N3O5
Mol. Mass.445.416
SMILESC[C@H](NC(=O)c1cn2C[C@@H]3O[C@H]4CC[C@H](C4)N3C(=O)c2c(O)c1=O)c1ccc(F)cc1F