Reaction Details
TargetSolute carrier family 22 member 2
LigandBDBM335487
Substrate/Competitorn/a
Meas. Tech.Inhibition Assay
IC50 358±n/a nM
Citation Jin, HLazerwith, SEPyun, HBacon, EMMorganelli, PAJi, M Substituted 2,3,4,5,7,9,13,13a-octahydropyrido[1′,2′:4,5]pyrazino[2,1-b][1,3]OXAZEPINES and methods for treating viral infections US Patent US9732092 Publication Date 8/15/2017
 
Solute carrier family 22 member 2
Name:Solute carrier family 22 member 2
Type:PROTEIN
Mol. Mass.:62591.01
Organism:Homo sapiens (Human)
Description:ChEMBL_1484077
Residue:555
BDBM335487
NameBDBM335487
Synonyms:US11548901, Compound 39 | US9732092, Compound 39
TypeSmall organic molecule
Emp. Form.C22H21F2N3O5
Mol. Mass.445.416
SMILESCC1C[C@@H]2C[C@H]1O[C@H]1Cn3cc(C(=O)NCc4ccc(F)cc4F)c(=O)c(O)c3C(=O)N21