Reaction Details
TargetSolute carrier family 22 member 2
LigandBDBM335495
Substrate/Competitorn/a
Meas. Tech.Inhibition Assay
IC50 42.0±n/a nM
Citation Jin, HLazerwith, SEPyun, HBacon, EMMorganelli, PAJi, M Substituted 2,3,4,5,7,9,13,13a-octahydropyrido[1′,2′:4,5]pyrazino[2,1-b][1,3]OXAZEPINES and methods for treating viral infections US Patent US9732092 Publication Date 8/15/2017
 
Solute carrier family 22 member 2
Name:Solute carrier family 22 member 2
Type:PROTEIN
Mol. Mass.:62591.01
Organism:Homo sapiens (Human)
Description:ChEMBL_1484077
Residue:555
BDBM335495
NameBDBM335495
Synonyms:(2R,5S,13aR)—N-(2-chloro-4-fluorobenzyl)-8-hydroxy-7,9-dioxo-2,3,4,5,7,9,13,13a-octahydro-2,5-methanopyrido[1′,2′:4,5]pyrazino[2,1-b][1,3]oxazepine-10-carboxamide US11548901, Compound 63 | US9732092, Compound 63
TypeSmall organic molecule
Emp. Form.C21H19ClFN3O5
Mol. Mass.447.844
SMILESOc1c2C(=O)N3[C@H]4CC[C@H](C4)O[C@@H]3Cn2cc(C(=O)NCc2ccc(F)cc2Cl)c1=O