Reaction Details
TargetSolute carrier family 22 member 2
LigandBDBM335500
Substrate/Competitorn/a
Meas. Tech.Inhibition Assay
IC50 1357±n/a nM
Citation Jin, HLazerwith, SEPyun, HBacon, EMMorganelli, PAJi, M Substituted 2,3,4,5,7,9,13,13a-octahydropyrido[1′,2′:4,5]pyrazino[2,1-b][1,3]OXAZEPINES and methods for treating viral infections US Patent US9732092 Publication Date 8/15/2017
 
Solute carrier family 22 member 2
Name:Solute carrier family 22 member 2
Type:PROTEIN
Mol. Mass.:62591.01
Organism:Homo sapiens (Human)
Description:ChEMBL_1484077
Residue:555
BDBM335500
NameBDBM335500
Synonyms:(1R,3R,11aS)-6-hydroxy-5,7-dioxo-N-(2,4,6-trifluorobenzyl)-2,3,5,7,11,11a-hexahydro-1H-1,3-methanopyrido[1,2-a]pyrrolo[1,2-d]pyrazine-8-carboxamide | US9732092, Compound 96
TypeSmall organic molecule
Emp. Form.C20H16F3N3O4
Mol. Mass.419.3539
SMILESOc1c2C(=O)N3C4CC(C4)[C@H]3Cn2cc(C(=O)NCc2c(F)cc(F)cc2F)c1=O