Reaction Details
TargetFlap endonuclease 1
LigandBDBM166937
Substrate/Competitorn/a
Meas. Tech.Binding Assay
Ki 2.00±n/a nM
Citation Eccles, WFitzgerald, AEHack, MDHawryluk, NAJones, WMKeith, JMKrawczuk, PLebsack, ADLiu, JMani, NSMcClure, KJMeduna, SPRosen, MD FLAP modulators US Patent US9732093 Publication Date 8/15/2017
 
Flap endonuclease 1
Name:Flap endonuclease 1
Type:PROTEIN
Mol. Mass.:42602.57
Organism:Homo sapiens (Human)
Description:ChEMBL_1517026
Residue:380
BDBM166937
NameBDBM166937
Synonyms:US9073876, 23 | US9732093, Compound 23
TypeSmall organic molecule
Emp. Form.C23H22FN3O3
Mol. Mass.407.4375
SMILESNc1cnc(cn1)-c1ccc(C2CCC2)c(OCc2ccc(CC(O)=O)cc2)c1F