Reaction Details
TargetFlap endonuclease 1
LigandBDBM167111
Substrate/Competitorn/a
Meas. Tech.Binding Assay
Ki 2.20±n/a nM
Citation Eccles, WFitzgerald, AEHack, MDHawryluk, NAJones, WMKeith, JMKrawczuk, PLebsack, ADLiu, JMani, NSMcClure, KJMeduna, SPRosen, MD FLAP modulators US Patent US9732093 Publication Date 8/15/2017
 
Flap endonuclease 1
Name:Flap endonuclease 1
Type:PROTEIN
Mol. Mass.:42602.57
Organism:Homo sapiens (Human)
Description:ChEMBL_1517026
Residue:380
BDBM167111
NameBDBM167111
Synonyms:US9073876, 195 | US9732093, Compound 195
TypeSmall organic molecule
Emp. Form.C26H25FN2O4
Mol. Mass.448.4861
SMILESOC(=O)Cc1ccc(COc2c(F)c(ccc2C2CCC2)-c2cnc3NCCOc3c2)cc1