Reaction Details
TargetCarbonic anhydrase 4
LigandBDBM13063
Substrate/CompetitorBDBM11326
Meas. Tech.Carbonic Anhydrase Enzyme Inhibition Assay
pH7.4±n/a
Temperature298.15±n/a K
IC50 340±n/a nM
Citation Weber, ACasini, AHeine, AKuhn, DSupuran, CTScozzafava, AKlebe, G Unexpected nanomolar inhibition of carbonic anhydrase by COX-2-selective celecoxib: new pharmacological opportunities due to related binding site recognition. J Med Chem47:550-7 (2004) 
 
Carbonic anhydrase 4
Name:Carbonic anhydrase 4
Type:Enzyme
Mol. Mass.:35152.74
Organism:Bos taurus (bovine)
Description:Bovine isozyme, isolated from lung microsomes
Residue:312
BDBM13063
BDBM11326
NameBDBM13063
Synonyms:4-(5-methyl-3-phenyl-1,2-oxazol-4-yl)benzene-1-sulfonamide CHEMBL865 Valdecoxib | cid_119607
TypeSmall organic molecule
Emp. Form.C16H14N2O3S
Mol. Mass.314.359
SMILESCc1onc(c1-c1ccc(cc1)S(N)(=O)=O)-c1ccccc1