Reaction Details
TargetEpidermal growth factor receptor [T790M,L858R]
LigandBDBM199995
Substrate/Competitorn/a
Meas. Tech.TBD
IC50 0.088±n/a nM
Citation Zhou, CZhang, G Fused tricyclic amide compounds as multiple kinase inhibitors US Patent US9670231 Publication Date 6/6/2017
 
Epidermal growth factor receptor [T790M,L858R]
Name:Epidermal growth factor receptor [T790M,L858R]
Type:n/a
Mol. Mass.:134353.72
Organism:Homo sapiens (Human)
Description:P00533[T790M,L858R]
Residue:1210
BDBM199995
NameBDBM199995
Synonyms:US9670231, 1.3 | US9670231, 1.34
TypeSmall organic molecule
Emp. Form.C31H30F3N5O4
Mol. Mass.593.5962
SMILESCN1CCN(Cc2ccc(cc2C(F)(F)F)C(=O)N[C@@H]2[C@H]3Oc4ccc(Oc5ccnc6NC(=O)CCc56)cc4[C@@H]23)CC1