Reaction Details
TargetRAF proto-oncogene serine/threonine-protein kinase
LigandBDBM200336
Substrate/Competitorn/a
Meas. Tech.TBD
IC50 1.30±n/a nM
Citation Zhou, CZhang, G Fused tricyclic amide compounds as multiple kinase inhibitors US Patent US9670231 Publication Date 6/6/2017
 
RAF proto-oncogene serine/threonine-protein kinase
Name:RAF proto-oncogene serine/threonine-protein kinase
Type:Serine/threonine-protein kinase
Mol. Mass.:73082.52
Organism:Homo sapiens (Human)
Description:P04049
Residue:648
BDBM200336
NameBDBM200336
Synonyms:US9670231, 1.12
TypeSmall organic molecule
Emp. Form.C33H32F3N5O4
Mol. Mass.619.6335
SMILESFC(F)(F)c1cc(ccc1CN1CCN2CCC[C@@H]2C1)C(=O)N[C@@H]1[C@H]2Oc3ccc(Oc4ccnc5NC(=O)CCc45)cc3[C@@H]12