Reaction Details
TargetLysine-specific demethylase 4A
LigandBDBM320432
Substrate/Competitorn/a
Meas. Tech.Enzymatic Assay
IC50<100±n/a nM
Citation Chen, YKWallace, MB Histone demethylase inhibitors US Patent US9738637 Publication Date 8/22/2017
 
Lysine-specific demethylase 4A
Name:Lysine-specific demethylase 4A
Type:Enzyme
Mol. Mass.:120647.83
Organism:Homo sapiens (Human)
Description:O75164
Residue:1064
BDBM320432
NameBDBM320432
Synonyms:2-(pyrrolidin-1-ylcarbonyl)-1H- pyrrolo[3,2-b]pyridine-7- carboxylic acid US9738637, Example 99
TypeSmall organic molecule
Emp. Form.C13H13N3O3
Mol. Mass.259.2606
SMILESOC(=O)c1ccnc2cc([nH]c12)C(=O)N1CCCC1