Reaction Details
TargetCoagulation factor XI
LigandBDBM335753
Substrate/Competitorn/a
Meas. Tech.Enzyme Inhibition Assay
Ki<5.00±n/a nM
Citation Pinto, DJClarke, CGSmith, II, LMOrwat, MJJeon, YCorte, JR Tetrahydroisoquinolines containing substituted azoles as factor XIa inhibitors US Patent US9738655 Publication Date 8/22/2017
 
Coagulation factor XI
Name:Coagulation factor XI
Type:Enzyme
Mol. Mass.:70130.58
Organism:Homo sapiens (Human)
Description:P03951
Residue:625
BDBM335753
NameBDBM335753
Synonyms:4-(2-(1-(3-Chloro-2-fluorophenyl)-1H-pyrazole-4-carbonyl)-5-(4-((2-(dimethylamino)ethyl)carbamoyl)phenyl)-1,2,3,4-tetrahydroisoquinoline-1-carboxamido)benzoic acid, TFA salt | US9738655, Example 8
TypeSmall organic molecule
Emp. Form.C38H34ClFN6O5
Mol. Mass.709.165
SMILESCN(C)CCNC(=O)c1ccc(cc1)-c1cccc2C(N(CCc12)C(=O)c1cnn(c1)-c1cccc(Cl)c1F)C(=O)Nc1ccc(cc1)C(O)=O