Reaction Details
TargetPlasma kallikrein
LigandBDBM335751
Substrate/Competitorn/a
Meas. Tech.Enzyme Inhibition Assay
Ki 2.40±n/a nM
Citation Pinto, DJClarke, CGSmith, II, LMOrwat, MJJeon, YCorte, JR Tetrahydroisoquinolines containing substituted azoles as factor XIa inhibitors US Patent US9738655 Publication Date 8/22/2017
 
Plasma kallikrein
Name:Plasma kallikrein
Type:Protein
Mol. Mass.:71391.16
Organism:Homo sapiens (Human)
Description:P03952
Residue:638
BDBM335751
NameBDBM335751
Synonyms:4-(2-(1-(3-Chloro-2-fluorophenyl)-1H-1,2,3-triazole-4-carbonyl)-5-(4-((2-(dimethylamino)ethyl)carbamoyl)phenyl)-1,2,3,4-tetrahydroisoquinoline-1-carboxamido)benzoic acid | US9738655, Example 6
TypeSmall organic molecule
Emp. Form.C37H33ClFN7O5
Mol. Mass.710.153
SMILESCN(C)CCNC(=O)c1ccc(cc1)-c1cccc2C(N(CCc12)C(=O)c1cn(nn1)-c1cccc(Cl)c1F)C(=O)Nc1ccc(cc1)C(O)=O