Reaction Details
TargetPlasma kallikrein
LigandBDBM335764
Substrate/Competitorn/a
Meas. Tech.Enzyme Inhibition Assay
Ki 1.51±n/a nM
Citation Pinto, DJClarke, CGSmith, II, LMOrwat, MJJeon, YCorte, JR Tetrahydroisoquinolines containing substituted azoles as factor XIa inhibitors US Patent US9738655 Publication Date 8/22/2017
 
Plasma kallikrein
Name:Plasma kallikrein
Type:Protein
Mol. Mass.:71391.16
Organism:Homo sapiens (Human)
Description:P03952
Residue:638
BDBM335764
NameBDBM335764
Synonyms:4-((S)-2-((R)-3-(3-Chloro-2-fluorophenyl)-4,5-dihydroisoxazole-5-carbonyl)-5-(6-(methylcarbamoyl)pyridin-3-yl)-1,2,3,4-tetrahydroisoquinoline-1-carboxamido)benzoic acid, TFA salt | US9738655, Example 19
TypeSmall organic molecule
Emp. Form.C34H27ClFN5O6
Mol. Mass.656.059
SMILESCNC(=O)c1ccc(cn1)-c1cccc2[C@H](N(CCc12)C(=O)[C@H]1CC(=NO1)c1cccc(Cl)c1F)C(=O)Nc1ccc(cc1)C(O)=O