Reaction Details
TargetPlasma kallikrein
LigandBDBM335873
Substrate/Competitorn/a
Meas. Tech.Enzyme Inhibition Assay
Ki 0.960±n/a nM
Citation Pinto, DJClarke, CGSmith, II, LMOrwat, MJJeon, YCorte, JR Tetrahydroisoquinolines containing substituted azoles as factor XIa inhibitors US Patent US9738655 Publication Date 8/22/2017
 
Plasma kallikrein
Name:Plasma kallikrein
Type:Protein
Mol. Mass.:71391.16
Organism:Homo sapiens (Human)
Description:P03952
Residue:638
BDBM335873
NameBDBM335873
Synonyms:(S)-N-(4-(1H-Pyrazol-4-yl)phenyl)-2-(1-(3-chloro-2-fluorophenyl)-1H-1,2,3-triazole-4-carbonyl)-5-(4-(dimethylamino)piperidin-1-yl)-1,2,3,4-tetrahydroisoquinoline-1-carboxamide, bis-TFA salt | US9738655, Example 104
TypeSmall organic molecule
Emp. Form.C35H35ClFN9O2
Mol. Mass.668.163
SMILESCN(C)C1CCN(CC1)c1cccc2[C@H](N(CCc12)C(=O)c1cn(nn1)-c1cccc(Cl)c1F)C(=O)Nc1ccc(cc1)-c1cn[nH]c1