Reaction Details
TargetPlasma kallikrein
LigandBDBM335881
Substrate/Competitorn/a
Meas. Tech.Enzyme Inhibition Assay
Ki 3.16±n/a nM
Citation Pinto, DJClarke, CGSmith, II, LMOrwat, MJJeon, YCorte, JR Tetrahydroisoquinolines containing substituted azoles as factor XIa inhibitors US Patent US9738655 Publication Date 8/22/2017
 
Plasma kallikrein
Name:Plasma kallikrein
Type:Protein
Mol. Mass.:71391.16
Organism:Homo sapiens (Human)
Description:P03952
Residue:638
BDBM335881
NameBDBM335881
Synonyms:4-(2-(1-(3-Chloro-2-fluorophenyl)-1H-1,2,3-triazole-4-carbonyl)-5-(piperidin-4-yloxy)-1,2,3,4-tetrahydroisoquinoline-1-carboxamido)benzoic acid, TFA salt | US9738655, Example 112
TypeSmall organic molecule
Emp. Form.C31H28ClFN6O5
Mol. Mass.619.043
SMILESOC(=O)c1ccc(NC(=O)C2N(CCc3c(OC4CCNCC4)cccc23)C(=O)c2cn(nn2)-c2cccc(Cl)c2F)cc1