Reaction Details
TargetPlasma kallikrein
LigandBDBM335985
Substrate/Competitorn/a
Meas. Tech.Enzyme Inhibition Assay
Ki 2.89±n/a nM
Citation Pinto, DJClarke, CGSmith, II, LMOrwat, MJJeon, YCorte, JR Tetrahydroisoquinolines containing substituted azoles as factor XIa inhibitors US Patent US9738655 Publication Date 8/22/2017
 
Plasma kallikrein
Name:Plasma kallikrein
Type:Protein
Mol. Mass.:71391.16
Organism:Homo sapiens (Human)
Description:P03952
Residue:638
BDBM335985
NameBDBM335985
Synonyms:4-(2-(5-amino-1-(3-chloro- 2-fluorophenyl)-1H- pyrazole-4-carbonyl)-5-(4- methylpiperazin-1- yl)-1,2,3,4- tetrahydroisoquinoline-1- carboxamido)benzoic acid, 2 TFA salt | US9738655, Example 212
TypeSmall organic molecule
Emp. Form.C32H31ClFN7O4
Mol. Mass.632.084
SMILESCN1CCN(CC1)c1cccc2C(N(CCc12)C(=O)c1cnn(c1N)-c1cccc(Cl)c1F)C(=O)Nc1ccc(cc1)C(O)=O