Reaction Details
TargetPlasma kallikrein
LigandBDBM336066
Substrate/Competitorn/a
Meas. Tech.Enzyme Inhibition Assay
Ki 2.63±n/a nM
Citation Pinto, DJClarke, CGSmith, II, LMOrwat, MJJeon, YCorte, JR Tetrahydroisoquinolines containing substituted azoles as factor XIa inhibitors US Patent US9738655 Publication Date 8/22/2017
 
Plasma kallikrein
Name:Plasma kallikrein
Type:Protein
Mol. Mass.:71391.16
Organism:Homo sapiens (Human)
Description:P03952
Residue:638
BDBM336066
NameBDBM336066
Synonyms:4-((S)-2-((R)-3-(3-chloro-2- fluorophenyl)-4,5- dihydroisoxazole-5-carbonyl)-5- (3-oxomorpholino)-1,2,3,4- tetrahydroisoquinoline-1- carboxamido)benzoic acid, | US9738655, Example 289
TypeSmall organic molecule
Emp. Form.C31H26ClFN4O7
Mol. Mass.621.012
SMILESOC(=O)c1ccc(NC(=O)[C@H]2N(CCc3c2cccc3N2CCOCC2=O)C(=O)[C@H]2CC(=NO2)c2cccc(Cl)c2F)cc1