Reaction Details
TargetKallikrein-7
LigandBDBM336130
Substrate/Competitorn/a
Meas. Tech.Inhibition Assay
IC50 80.0±n/a nM
Citation Linschoten, M Kallikrein 7 inhibitors US Patent US9744148 Publication Date 8/29/2017
 
Kallikrein-7
Name:Kallikrein-7
Type:PROTEIN
Mol. Mass.:27535.05
Organism:Homo sapiens (Human)
Description:ChEMBL_1469257
Residue:253
BDBM336130
NameBDBM336130
Synonyms:US9744148, 4
TypeSmall organic molecule
Emp. Form.C18H18ClNO4
Mol. Mass.347.793
SMILESCOc1ccc(NC(=O)C(C)OC(=O)Cc2ccc(Cl)cc2)cc1