Reaction Details
TargetKallikrein-7
LigandBDBM336138
Substrate/Competitorn/a
Meas. Tech.Inhibition Assay
IC50 150±n/a nM
Citation Linschoten, M Kallikrein 7 inhibitors US Patent US9744148 Publication Date 8/29/2017
 
Kallikrein-7
Name:Kallikrein-7
Type:PROTEIN
Mol. Mass.:27535.05
Organism:Homo sapiens (Human)
Description:ChEMBL_1469257
Residue:253
BDBM336138
NameBDBM336138
Synonyms:US9744148, 11
TypeSmall organic molecule
Emp. Form.C19H27NO4
Mol. Mass.333.422
SMILESCCC(OC(=O)CCC1CCCC1)C(=O)Nc1ccc(OC)cc1