Reaction Details
TargetKallikrein-7
LigandBDBM336159
Substrate/Competitorn/a
Meas. Tech.Inhibition Assay
IC50 340±n/a nM
Citation Linschoten, M Kallikrein 7 inhibitors US Patent US9744148 Publication Date 8/29/2017
 
Kallikrein-7
Name:Kallikrein-7
Type:PROTEIN
Mol. Mass.:27535.05
Organism:Homo sapiens (Human)
Description:ChEMBL_1469257
Residue:253
BDBM336159
NameBDBM336159
Synonyms:US9744148, 28
TypeSmall organic molecule
Emp. Form.C22H22N2O4
Mol. Mass.378.4211
SMILESCC[C@H](OC(=O)C(c1ccccc1)c1ccccc1)C(=O)Nc1cc(C)on1