Reaction Details
TargetKallikrein-7
LigandBDBM336174
Substrate/Competitorn/a
Meas. Tech.Inhibition Assay
IC50 630±n/a nM
Citation Linschoten, M Kallikrein 7 inhibitors US Patent US9744148 Publication Date 8/29/2017
 
Kallikrein-7
Name:Kallikrein-7
Type:PROTEIN
Mol. Mass.:27535.05
Organism:Homo sapiens (Human)
Description:ChEMBL_1469257
Residue:253
BDBM336174
NameBDBM336174
Synonyms:US9744148, 43
TypeSmall organic molecule
Emp. Form.C25H25NO4
Mol. Mass.403.4703
SMILESCCC(OC(=O)C(c1ccccc1)c1ccccc1)C(=O)Nc1ccc(OC)cc1