Reaction Details
TargetCoagulation factor VII
LigandBDBM13552
Substrate/CompetitorBDBM13553
Meas. Tech.Serine Protease Inhibition Assay
pH7.8±n/a
Temperature295.15±n/a K
Ki 4±n/a nM
Citation Zbinden, KGObst-Sander, UHilpert, KKuhne, HBanner, DWBohm, HJStahl, MAckermann, JAlig, LWeber, LWessel, HPRiederer, MATschopp, TBLave, T Selective and orally bioavailable phenylglycine tissue factor/factor VIIa inhibitors. Bioorg Med Chem Lett15:5344-52 (2005) 
 
Coagulation factor VII
Name:Coagulation factor VII
Type:Enzyme
Mol. Mass.:51599.89
Organism:Homo sapiens (Human)
Description:n/a
Residue:466
BDBM13552
BDBM13553
NameBDBM13552
Synonyms:(2S)-2-[(2R)-2-[4-(benzyloxy)-3-methoxyphenyl]-2-[(4-carbamimidoylphenyl)amino]acetamido]-2-phenylacetic acid phenylglycine deriv. 1
TypeSmall organic molecule
Emp. Form.C31H30N4O5
Mol. Mass.538.5937
SMILESCOc1cc(ccc1OCc1ccccc1)[C@@H](Nc1ccc(cc1)C(N)=N)C(=O)N[C@H](C(O)=O)c1ccccc1