Reaction Details
TargetCoagulation factor VII
LigandBDBM13561
Substrate/CompetitorBDBM13553
Meas. Tech.Serine Protease Inhibition Assay
pH7.8±n/a
Temperature295.15±n/a K
Ki 69±n/a nM
Citation Zbinden, KGObst-Sander, UHilpert, KKuhne, HBanner, DWBohm, HJStahl, MAckermann, JAlig, LWeber, LWessel, HPRiederer, MATschopp, TBLave, T Selective and orally bioavailable phenylglycine tissue factor/factor VIIa inhibitors. Bioorg Med Chem Lett15:5344-52 (2005) 
 
Coagulation factor VII
Name:Coagulation factor VII
Type:Enzyme
Mol. Mass.:51599.89
Organism:Homo sapiens (Human)
Description:n/a
Residue:466
BDBM13561
BDBM13553
NameBDBM13561
Synonyms:2-[(4-carbamimidoylphenyl)amino]-2-[3-ethenyl-5-(oxan-4-yloxy)phenyl]acetic acid | phenylglycine deriv. 9
TypeSmall organic molecule
Emp. Form.C22H25N3O4
Mol. Mass.395.4516
SMILESNC(=N)c1ccc(NC(C(O)=O)c2cc(OC3CCOCC3)cc(C=C)c2)cc1