Reaction Details
TargetCoagulation factor VII
LigandBDBM13569
Substrate/CompetitorBDBM13553
Meas. Tech.Serine Protease Inhibition Assay
pH7.8±n/a
Temperature295.15±n/a K
Ki 129±n/a nM
Citation Zbinden, KGObst-Sander, UHilpert, KKuhne, HBanner, DWBohm, HJStahl, MAckermann, JAlig, LWeber, LWessel, HPRiederer, MATschopp, TBLave, T Selective and orally bioavailable phenylglycine tissue factor/factor VIIa inhibitors. Bioorg Med Chem Lett15:5344-52 (2005) 
 
Coagulation factor VII
Name:Coagulation factor VII
Type:Enzyme
Mol. Mass.:51599.89
Organism:Homo sapiens (Human)
Description:n/a
Residue:466
BDBM13569
BDBM13553
NameBDBM13569
Synonyms:2-[(4-carbamimidoylphenyl)amino]-2-{3-ethynyl-5-[(3R)-oxolan-3-yloxy]phenyl}acetic acid | phenylglycine deriv. 17
TypeSmall organic molecule
Emp. Form.C21H21N3O4
Mol. Mass.379.4091
SMILESNC(=N)c1ccc(NC(C(O)=O)c2cc(O[C@@H]3CCOC3)cc(c2)C#C)cc1