Reaction Details
TargetProthrombin
LigandBDBM13556
Substrate/CompetitorBDBM13573
Meas. Tech.Serine Protease Inhibition Assay
Ki 74±n/a nM
Citation Zbinden, KGObst-Sander, UHilpert, KKuhne, HBanner, DWBohm, HJStahl, MAckermann, JAlig, LWeber, LWessel, HPRiederer, MATschopp, TBLave, T Selective and orally bioavailable phenylglycine tissue factor/factor VIIa inhibitors. Bioorg Med Chem Lett15:5344-52 (2005) 
 
Prothrombin
Name:Prothrombin
Type:Protein
Mol. Mass.:70029.57
Organism:Homo sapiens (Human)
Description:P00734
Residue:622
BDBM13556
BDBM13573
NameBDBM13556
Synonyms:2-[4-(benzyloxy)-3-methoxyphenyl]-2-[(4-carbamimidoylphenyl)amino]acetic acid | phenylglycine deriv. 4
TypeSmall organic molecule
Emp. Form.C23H23N3O4
Mol. Mass.405.4464
SMILESCOc1cc(ccc1OCc1ccccc1)C(Nc1ccc(cc1)C(N)=N)C(O)=O