Reaction Details
TargetCoagulation factor X
LigandBDBM13556
Substrate/CompetitorBDBM12658
Meas. Tech.Serine Protease Inhibition Assay
Ki 730±n/a nM
Citation Zbinden, KGObst-Sander, UHilpert, KKuhne, HBanner, DWBohm, HJStahl, MAckermann, JAlig, LWeber, LWessel, HPRiederer, MATschopp, TBLave, T Selective and orally bioavailable phenylglycine tissue factor/factor VIIa inhibitors. Bioorg Med Chem Lett15:5344-52 (2005) 
 
Coagulation factor X
Name:Coagulation factor X
Type:Enzyme
Mol. Mass.:54726.60
Organism:Homo sapiens (Human)
Description:n/a
Residue:488
BDBM13556
BDBM12658
NameBDBM13556
Synonyms:2-[4-(benzyloxy)-3-methoxyphenyl]-2-[(4-carbamimidoylphenyl)amino]acetic acid | phenylglycine deriv. 4
TypeSmall organic molecule
Emp. Form.C23H23N3O4
Mol. Mass.405.4464
SMILESCOc1cc(ccc1OCc1ccccc1)C(Nc1ccc(cc1)C(N)=N)C(O)=O