Reaction Details
TargetProthrombin
LigandBDBM13555
Substrate/CompetitorBDBM13573
Meas. Tech.Serine Protease Inhibition Assay
Ki 6400±n/a nM
Citation Groebke Zbinden, KBanner, DWAckermann, JD'Arcy, AKirchhofer, DJi, YHTschopp, TBWallbaum, SWeber, L Design of selective phenylglycine amide tissue factor/factor VIIa inhibitors. Bioorg Med Chem Lett15:817-22 (2005) 
 
Prothrombin
Name:Prothrombin
Type:Protein
Mol. Mass.:70029.57
Organism:Homo sapiens (Human)
Description:P00734
Residue:622
BDBM13555
BDBM13573
NameBDBM13555
Synonyms:(2S)-2-{2-[4-(benzyloxy)-5-methoxy-2-(2-phenylacetyl)phenyl]-2-[(4-carbamimidoylphenyl)amino]acetamido}-2-phenylacetic acid phenylglycine deriv. 3
TypeSmall organic molecule
Emp. Form.C39H36N4O6
Mol. Mass.656.7263
SMILESCOc1cc(C(Nc2ccc(cc2)C(N)=N)C(=O)N[C@H](C(O)=O)c2ccccc2)c(cc1OCc1ccccc1)C(=O)Cc1ccccc1