Reaction Details
TargetCoagulation factor X
LigandBDBM13555
Substrate/CompetitorBDBM12658
Meas. Tech.Serine Protease Inhibition Assay
Ki 19000±n/a nM
Citation Groebke Zbinden, KBanner, DWAckermann, JD'Arcy, AKirchhofer, DJi, YHTschopp, TBWallbaum, SWeber, L Design of selective phenylglycine amide tissue factor/factor VIIa inhibitors. Bioorg Med Chem Lett15:817-22 (2005) 
 
Coagulation factor X
Name:Coagulation factor X
Type:Enzyme
Mol. Mass.:54726.60
Organism:Homo sapiens (Human)
Description:n/a
Residue:488
BDBM13555
BDBM12658
NameBDBM13555
Synonyms:(2S)-2-{2-[4-(benzyloxy)-5-methoxy-2-(2-phenylacetyl)phenyl]-2-[(4-carbamimidoylphenyl)amino]acetamido}-2-phenylacetic acid phenylglycine deriv. 3
TypeSmall organic molecule
Emp. Form.C39H36N4O6
Mol. Mass.656.7263
SMILESCOc1cc(C(Nc2ccc(cc2)C(N)=N)C(=O)N[C@H](C(O)=O)c2ccccc2)c(cc1OCc1ccccc1)C(=O)Cc1ccccc1