Reaction Details
TargetSerine protease 1
LigandBDBM13555
Substrate/CompetitorBDBM13574
Meas. Tech.Serine Protease Inhibition Assay
Ki 80±n/a nM
Citation Groebke Zbinden, KBanner, DWAckermann, JD'Arcy, AKirchhofer, DJi, YHTschopp, TBWallbaum, SWeber, L Design of selective phenylglycine amide tissue factor/factor VIIa inhibitors. Bioorg Med Chem Lett15:817-22 (2005) 
 
Serine protease 1
Name:Serine protease 1
Type:Enzyme
Mol. Mass.:25790.52
Organism:Bos taurus (bovine)
Description:P00760
Residue:246
BDBM13555
BDBM13574
NameBDBM13555
Synonyms:(2S)-2-{2-[4-(benzyloxy)-5-methoxy-2-(2-phenylacetyl)phenyl]-2-[(4-carbamimidoylphenyl)amino]acetamido}-2-phenylacetic acid phenylglycine deriv. 3
TypeSmall organic molecule
Emp. Form.C39H36N4O6
Mol. Mass.656.7263
SMILESCOc1cc(C(Nc2ccc(cc2)C(N)=N)C(=O)N[C@H](C(O)=O)c2ccccc2)c(cc1OCc1ccccc1)C(=O)Cc1ccccc1