Reaction Details
TargetCoagulation factor X
LigandBDBM13622
Substrate/CompetitorBDBM12500
Meas. Tech.Factor Xa Inhibition Assay
pH7.8±n/a
Temperature298.15±n/a K
Ki 314±n/a nM
Citation Matter, HWill, DWNazare, MSchreuder, HLaux, VWehner, V Structural requirements for factor Xa inhibition by 3-oxybenzamides with neutral P1 substituents: combining X-ray crystallography, 3D-QSAR, and tailored scoring functions. J Med Chem48:3290-312 (2005) 
 
Coagulation factor X
Name:Coagulation factor X
Type:Enzyme
Mol. Mass.:54726.60
Organism:Homo sapiens (Human)
Description:n/a
Residue:488
BDBM13622
BDBM12500
NameBDBM13622
Synonyms:3-Oxybenzamide 8 | 4-chloro-3-[2-(4-methoxyphenyl)ethoxy]-N-{[1-(pyridin-4-yl)piperidin-4-yl]methyl}benzamide
TypeSmall organic molecule
Emp. Form.C27H30ClN3O3
Mol. Mass.479.998
SMILESCOc1ccc(CCOc2cc(ccc2Cl)C(=O)NCC2CCN(CC2)c2ccncc2)cc1