Reaction Details
TargetCoagulation factor X
LigandBDBM13631
Substrate/CompetitorBDBM12500
Meas. Tech.Factor Xa Inhibition Assay
Ki 206±n/a nM
Citation Matter, HWill, DWNazare, MSchreuder, HLaux, VWehner, V Structural requirements for factor Xa inhibition by 3-oxybenzamides with neutral P1 substituents: combining X-ray crystallography, 3D-QSAR, and tailored scoring functions. J Med Chem48:3290-312 (2005) 
 
Coagulation factor X
Name:Coagulation factor X
Type:Enzyme
Mol. Mass.:54726.60
Organism:Homo sapiens (Human)
Description:n/a
Residue:488
BDBM13631
BDBM12500
NameBDBM13631
Synonyms:3-Oxybenzamide 17 | 4-fluoro-3-[2-(4-methylphenyl)ethoxy]-N-{[1-(pyridin-4-yl)piperidin-4-yl]methyl}benzamide
TypeSmall organic molecule
Emp. Form.C27H30FN3O2
Mol. Mass.447.5444
SMILESCc1ccc(CCOc2cc(ccc2F)C(=O)NCC2CCN(CC2)c2ccncc2)cc1