Reaction Details
TargetCoagulation factor X
LigandBDBM13641
Substrate/CompetitorBDBM12500
Meas. Tech.Factor Xa Inhibition Assay
Ki 156±n/a nM
Citation Matter, HWill, DWNazare, MSchreuder, HLaux, VWehner, V Structural requirements for factor Xa inhibition by 3-oxybenzamides with neutral P1 substituents: combining X-ray crystallography, 3D-QSAR, and tailored scoring functions. J Med Chem48:3290-312 (2005) 
 
Coagulation factor X
Name:Coagulation factor X
Type:Enzyme
Mol. Mass.:54726.60
Organism:Homo sapiens (Human)
Description:n/a
Residue:488
BDBM13641
BDBM12500
NameBDBM13641
Synonyms:3-Oxybenzamide 27 | 3-[2-(2,4-dichlorophenyl)ethoxy]-4-iodo-N-{[1-(pyridin-4-yl)piperidin-4-yl]methyl}benzamide
TypeSmall organic molecule
Emp. Form.C26H26Cl2IN3O2
Mol. Mass.610.314
SMILESClc1ccc(CCOc2cc(ccc2I)C(=O)NCC2CCN(CC2)c2ccncc2)c(Cl)c1