Reaction Details
TargetCoagulation factor X
LigandBDBM13643
Substrate/CompetitorBDBM12500
Meas. Tech.Factor Xa Inhibition Assay
Ki 140±n/a nM
Citation Matter, HWill, DWNazare, MSchreuder, HLaux, VWehner, V Structural requirements for factor Xa inhibition by 3-oxybenzamides with neutral P1 substituents: combining X-ray crystallography, 3D-QSAR, and tailored scoring functions. J Med Chem48:3290-312 (2005) 
 
Coagulation factor X
Name:Coagulation factor X
Type:Enzyme
Mol. Mass.:54726.60
Organism:Homo sapiens (Human)
Description:n/a
Residue:488
BDBM13643
BDBM12500
NameBDBM13643
Synonyms:3-Oxybenzamide 29 | 3-[2-(2,4-dichlorophenyl)ethoxy]-N-{[1-(pyridin-4-yl)piperidin-4-yl]methyl}-4-(trifluoromethyl)benzamide
TypeSmall organic molecule
Emp. Form.C27H26Cl2F3N3O2
Mol. Mass.552.415
SMILESFC(F)(F)c1ccc(cc1OCCc1ccc(Cl)cc1Cl)C(=O)NCC1CCN(CC1)c1ccncc1