Reaction Details
TargetCoagulation factor X
LigandBDBM13644
Substrate/CompetitorBDBM12500
Meas. Tech.Factor Xa Inhibition Assay
Ki 44±n/a nM
Citation Matter, HWill, DWNazare, MSchreuder, HLaux, VWehner, V Structural requirements for factor Xa inhibition by 3-oxybenzamides with neutral P1 substituents: combining X-ray crystallography, 3D-QSAR, and tailored scoring functions. J Med Chem48:3290-312 (2005) 
 
Coagulation factor X
Name:Coagulation factor X
Type:Enzyme
Mol. Mass.:54726.60
Organism:Homo sapiens (Human)
Description:n/a
Residue:488
BDBM13644
BDBM12500
NameBDBM13644
Synonyms:3-Oxybenzamide 30 | 4-cyano-3-[2-(2,4-dichlorophenyl)ethoxy]-N-{[1-(pyridin-4-yl)piperidin-4-yl]methyl}benzamide
TypeSmall organic molecule
Emp. Form.C27H26Cl2N4O2
Mol. Mass.509.427
SMILESClc1ccc(CCOc2cc(ccc2C#N)C(=O)NCC2CCN(CC2)c2ccncc2)c(Cl)c1