Reaction Details
TargetCoagulation factor X
LigandBDBM13647
Substrate/CompetitorBDBM12500
Meas. Tech.Factor Xa Inhibition Assay
Ki 75±n/a nM
Citation Matter, HWill, DWNazare, MSchreuder, HLaux, VWehner, V Structural requirements for factor Xa inhibition by 3-oxybenzamides with neutral P1 substituents: combining X-ray crystallography, 3D-QSAR, and tailored scoring functions. J Med Chem48:3290-312 (2005) 
 
Coagulation factor X
Name:Coagulation factor X
Type:Enzyme
Mol. Mass.:54726.60
Organism:Homo sapiens (Human)
Description:n/a
Residue:488
BDBM13647
BDBM12500
NameBDBM13647
Synonyms:3-Oxybenzamide 33 | 3-[2-(2,4-dichlorophenyl)ethoxy]-1-N-{[1-(pyridin-4-yl)piperidin-4-yl]methyl}benzene-1,4-dicarboxamide
TypeSmall organic molecule
Emp. Form.C27H28Cl2N4O3
Mol. Mass.527.442
SMILESClc1ccc(CCOc2cc(ccc2NC=O)C(=O)NCC2CCN(CC2)c2ccncc2)c(Cl)c1