Reaction Details
TargetCoagulation factor X
LigandBDBM13656
Substrate/CompetitorBDBM12500
Meas. Tech.Factor Xa Inhibition Assay
Ki 50±n/a nM
Citation Matter, HWill, DWNazare, MSchreuder, HLaux, VWehner, V Structural requirements for factor Xa inhibition by 3-oxybenzamides with neutral P1 substituents: combining X-ray crystallography, 3D-QSAR, and tailored scoring functions. J Med Chem48:3290-312 (2005) 
 
Coagulation factor X
Name:Coagulation factor X
Type:Enzyme
Mol. Mass.:54726.60
Organism:Homo sapiens (Human)
Description:n/a
Residue:488
BDBM13656
BDBM12500
NameBDBM13656
Synonyms:3-Oxybenzamide 42 | 3-[2-(2,4-dichlorophenyl)ethoxy]-4,5-dimethoxy-N-{[1-(pyridin-4-yl)piperidin-4-yl]methyl}benzamide
TypeSmall organic molecule
Emp. Form.C28H31Cl2N3O4
Mol. Mass.544.469
SMILESCOc1cc(cc(OCCc2ccc(Cl)cc2Cl)c1OC)C(=O)NCC1CCN(CC1)c1ccncc1