Reaction Details
TargetCoagulation factor X
LigandBDBM13660
Substrate/CompetitorBDBM12500
Meas. Tech.Factor Xa Inhibition Assay
Ki 86±n/a nM
Citation Matter, HWill, DWNazare, MSchreuder, HLaux, VWehner, V Structural requirements for factor Xa inhibition by 3-oxybenzamides with neutral P1 substituents: combining X-ray crystallography, 3D-QSAR, and tailored scoring functions. J Med Chem48:3290-312 (2005) 
 
Coagulation factor X
Name:Coagulation factor X
Type:Enzyme
Mol. Mass.:54726.60
Organism:Homo sapiens (Human)
Description:n/a
Residue:488
BDBM13660
BDBM12500
NameBDBM13660
Synonyms:3-Oxybenzamide 46 | 4-bromo-3-[2-(2,4-dichlorophenyl)ethoxy]-5-ethoxy-N-{[1-(pyridin-4-yl)piperidin-4-yl]methyl}benzamide
TypeSmall organic molecule
Emp. Form.C28H30BrCl2N3O3
Mol. Mass.607.366
SMILESCCOc1cc(cc(OCCc2ccc(Cl)cc2Cl)c1Br)C(=O)NCC1CCN(CC1)c1ccncc1