Reaction Details
TargetCoagulation factor X
LigandBDBM13662
Substrate/CompetitorBDBM12500
Meas. Tech.Factor Xa Inhibition Assay
Ki 10±n/a nM
Citation Matter, HWill, DWNazare, MSchreuder, HLaux, VWehner, V Structural requirements for factor Xa inhibition by 3-oxybenzamides with neutral P1 substituents: combining X-ray crystallography, 3D-QSAR, and tailored scoring functions. J Med Chem48:3290-312 (2005) 
 
Coagulation factor X
Name:Coagulation factor X
Type:Enzyme
Mol. Mass.:54726.60
Organism:Homo sapiens (Human)
Description:n/a
Residue:488
BDBM13662
BDBM12500
NameBDBM13662
Synonyms:3-Oxybenzamide 48 | 4-chloro-3-[2-(2,4-dichlorophenyl)ethoxy]-5-methoxy-N-{[1-(pyridin-4-yl)piperidin-4-yl]methyl}benzamide
TypeSmall organic molecule
Emp. Form.C27H28Cl3N3O3
Mol. Mass.548.889
SMILESCOc1cc(cc(OCCc2ccc(Cl)cc2Cl)c1Cl)C(=O)NCC1CCN(CC1)c1ccncc1